{"text_format":"1","workbook":"xlsx","n_sheets":15,"sheets":["Summary","Calculations","January","February","March","April","May","June","July","August","September","October","November","December","Lookups"],"not_rendered":{"charts":2,"images":2,"macros":1,"external_links":0,"defined_names":2,"comments":0,"pivot_tables":0},"unopened":[],"bounds":{"document_bytes":16777216,"sheet_cells":100000,"rows_first":2000,"rows_last":500,"rows_between":2000,"halvings":0,"cell_chars":16384,"cell_head_chars":4096},"cells_cut":0,"cells_raw":0,"read":"whole","date_system":"1900"}

{"sheet":"Summary","index":0,"n_rows":54,"n_cols":13,"rows_kept":54,"cut":false,"hidden":false,"merged":[[40,0,40,12],[4,0,4,12]]}
[]
[]
[]
[]
["Total Infections by Type"]
["Month","Total","C. diff","Cellulitis/Wound Infection","COVID-19 (Presumptive)","GI Illness","Influenza (confirmed)","Influenza-like Illness","Norovirus","Pneumonia","Scabies","Strep Throat","Other"]
["January",{"$f":"SUM(C7:M7)","v":0},{"$f":"SUM(Calculations!E2)","v":0},{"$f":"SUM(Calculations!F2)","v":0},{"$f":"SUM(Calculations!G2)","v":0},{"$f":"SUM(Calculations!H2)","v":0},{"$f":"SUM(Calculations!I2)","v":0},{"$f":"SUM(Calculations!J2)","v":0},{"$f":"SUM(Calculations!K2)","v":0},{"$f":"SUM(Calculations!L2)","v":0},{"$f":"SUM(Calculations!M2)","v":0},{"$f":"SUM(Calculations!N2)","v":0},{"$f":"SUM(Calculations!O2)","v":0}]
["February",0,{"$f":"SUM(Calculations!E3)","v":0},{"$f":"SUM(Calculations!F3)","v":0},{"$f":"SUM(Calculations!G3)","v":0},{"$f":"SUM(Calculations!H3)","v":0},{"$f":"SUM(Calculations!I3)","v":0},{"$f":"SUM(Calculations!J3)","v":0},{"$f":"SUM(Calculations!K3)","v":0},{"$f":"SUM(Calculations!L3)","v":0},{"$f":"SUM(Calculations!M3)","v":0},{"$f":"SUM(Calculations!N3)","v":0},{"$f":"SUM(Calculations!O3)","v":0}]
["March",0,{"$f":"SUM(Calculations!E4)","v":0},{"$f":"SUM(Calculations!F4)","v":0},{"$f":"SUM(Calculations!G4)","v":0},{"$f":"SUM(Calculations!H4)","v":0},{"$f":"SUM(Calculations!I4)","v":0},{"$f":"SUM(Calculations!J4)","v":0},{"$f":"SUM(Calculations!K4)","v":0},{"$f":"SUM(Calculations!L4)","v":0},{"$f":"SUM(Calculations!M4)","v":0},{"$f":"SUM(Calculations!N4)","v":0},{"$f":"SUM(Calculations!O4)","v":0}]
["April",0,{"$f":"SUM(Calculations!E5)","v":0},{"$f":"SUM(Calculations!F5)","v":0},{"$f":"SUM(Calculations!G5)","v":0},{"$f":"SUM(Calculations!H5)","v":0},{"$f":"SUM(Calculations!I5)","v":0},{"$f":"SUM(Calculations!J5)","v":0},{"$f":"SUM(Calculations!K5)","v":0},{"$f":"SUM(Calculations!L5)","v":0},{"$f":"SUM(Calculations!M5)","v":0},{"$f":"SUM(Calculations!N5)","v":0},{"$f":"SUM(Calculations!O5)","v":0}]
{"$rows_left_out":45}
{"sheet":"Calculations","index":1,"n_rows":14,"n_cols":30,"rows_kept":14,"cut":false,"hidden":true,"merged":[]}
[null,null,"Results","Total","C. diff","Cellulitis/Wound Infection","COVID-19 (Presumptive)","GI Illness","Influenza (confirmed)","Influenza-like Illness","Norovirus","Pneumonia","Scabies","Strep Throat","Other",null,null,"Staff Type","RN/LPN","Nursing Assistant","Environmental Services","Dietary","Laundry","Rehab- PT/OT","Respiratory Therapy","Activities","Administration/Front Desk","Maintenance ","Provider- MD/DO/NP/PA","Other"]
[null,null,"January",{"$f":"SUM(E2:O2)","v":0},{"$f":"COUNTIF(January!O3:O701, \"C. diff\")","v":0},{"$f":"COUNTIF(January!O3:O701, \"Cellulitis/Wound Infection\")","v":0},{"$f":"COUNTIF(January!O3:O701, \"COVID-19 (Presumptive)\")","v":0},{"$f":"COUNTIF(January!O3:O701, \"GI Illness\")","v":0},{"$f":"COUNTIF(January!O3:O701, \"Influenza (confirmed)\")","v":0},{"$f":"COUNTIF(January!O3:O701, \"Influenza-like Illness\")","v":0},{"$f":"COUNTIF(January!O3:O701, \"Norovirus\")","v":0},{"$f":"COUNTIF(January!O3:O701, \"Pneumonia\")","v":0},{"$f":"COUNTIF(January!O3:O701, \"Scabies\")","v":0},{"$f":"COUNTIF(January!O3:O701, \"Strep Throat\")","v":0},{"$f":"COUNTIF(January!O3:O701, \"Other\")","v":0},null,null,"January ",{"$f":"COUNTIF(January!C3:C701, \"RN/LPN\")","v":0},{"$f":"COUNTIF(January!C3:C701, \"Nursing Assistant\")","v":0},{"$f":"COUNTIF(January!C3:C701, \"Environmental Services\")","v":0},{"$f":"COUNTIF(January!C3:C701, \"Dietary\")","v":0},{"$f":"COUNTIF(January!C3:C701, \"Laundry\")","v":0},{"$f":"COUNTIF(January!C3:C701, \"Rehab- PT/OT\")","v":0},{"$f":"COUNTIF(January!C3:C701, \"Respiratory Therapy\")","v":0},{"$f":"COUNTIF(January!C3:C701, \"Activities\")","v":0},{"$f":"COUNTIF(January!C3:C701, \"Administration/Front Desk\")","v":0},{"$f":"COUNTIF(January!C3:C701, \"Maintenance\")","v":0},{"$f":"COUNTIF(January!C3:C701, \"Provider- MD/DO/NP/PA\")","v":0},{"$f":"COUNTIF(January!C3:C701, \"Other\")","v":0}]
[null,null,"February",0,{"$f":"COUNTIF(February!O3:O701, \"C. diff\")","v":0},{"$f":"COUNTIF(February!O3:O701, \"Cellulitis/Wound Infection\")","v":0},{"$f":"COUNTIF(February!O3:O701, \"COVID-19 (Presumptive)\")","v":0},{"$f":"COUNTIF(February!O3:O701, \"GI Illness\")","v":0},{"$f":"COUNTIF(February!O3:O701, \"Influenza (confirmed)\")","v":0},{"$f":"COUNTIF(February!O3:O701, \"Influenza-like Illness\")","v":0},{"$f":"COUNTIF(February!O3:O701, \"Norovirus\")","v":0},{"$f":"COUNTIF(February!O3:O701, \"Pneumonia\")","v":0},{"$f":"COUNTIF(February!O3:O701, \"Scabies\")","v":0},{"$f":"COUNTIF(February!O3:O701, \"Strep Throat\")","v":0},{"$f":"COUNTIF(February!O3:O701, \"Other\")","v":0},null,null,"February",{"$f":"COUNTIF(February!C3:C599, \"RN/LPN\")","v":0},{"$f":"COUNTIF(February!C3:C599, \"Nursing Assistant\")","v":0},{"$f":"COUNTIF(February!C3:C599, \"Environmental Services\")","v":0},{"$f":"COUNTIF(February!C3:C599, \"Dietary\")","v":0},{"$f":"COUNTIF(February!C3:C599, \"Laundry\")","v":0},{"$f":"COUNTIF(February!C3:C599, \"Rehab- PT/OT\")","v":0},{"$f":"COUNTIF(February!C3:C599, \"Respiratory Therapy\")","v":0},{"$f":"COUNTIF(February!C3:C599, \"Activities\")","v":0},{"$f":"COUNTIF(February!C3:C599, \"Administration/Front Desk\")","v":0},{"$f":"COUNTIF(February!C3:C599, \"Maintenance\")","v":0},{"$f":"COUNTIF(February!C3:C599, \"Provider- MD/DO/NP/PA\")","v":0},{"$f":"COUNTIF(February!C3:C599, \"Other\")","v":0}]
[null,null,"March",0,{"$f":"COUNTIF(March!O3:O701, \"C. diff\")","v":0},{"$f":"COUNTIF(March!O3:O701, \"Cellulitis/Wound Infection\")","v":0},{"$f":"COUNTIF(March!O3:O701, \"COVID-19 (Presumptive)\")","v":0},{"$f":"COUNTIF(March!O3:O701, \"GI Illness\")","v":0},{"$f":"COUNTIF(March!O3:O701, \"Influenza (confirmed)\")","v":0},{"$f":"COUNTIF(March!O3:O701, \"Influenza-like Illness\")","v":0},{"$f":"COUNTIF(March!O3:O701, \"Norovirus\")","v":0},{"$f":"COUNTIF(March!O3:O701, \"Pneumonia\")","v":0},{"$f":"COUNTIF(March!O3:O701, \"Scabies\")","v":0},{"$f":"COUNTIF(March!O3:O701, \"Strep Throat\")","v":0},{"$f":"COUNTIF(March!O3:O701, \"Other\")","v":0},null,null,"March",{"$f":"COUNTIF(March!C3:C600, \"RN/LPN\")","v":0},{"$f":"COUNTIF(March!C3:C599, \"Nursing Assistant\")","v":0},{"$f":"COUNTIF(March!C3:C599, \"Environmental Services\")","v":0},{"$f":"COUNTIF(March!C3:C599, \"Dietary\")","v":0},{"$f":"COUNTIF(March!C3:C599, \"Laundry\")","v":0},{"$f":"COUNTIF(March!C3:C599, \"Rehab- PT/OT\")","v":0},{"$f":"COUNTIF(March!C3:C599, \"Respiratory Therapy\")","v":0},{"$f":"COUNTIF(March!C3:C599, \"Activities\")","v":0},{"$f":"COUNTIF(March!C3:C599, \"Administration/Front Desk\")","v":0},{"$f":"COUNTIF(March!C3:C599, \"Maintenance\")","v":0},{"$f":"COUNTIF(March!C3:C599, \"Provider- MD/DO/NP/PA\")","v":0},{"$f":"COUNTIF(March!C3:C599, \"Other\")","v":0}]
[null,null,"April",0,{"$f":"COUNTIF(April!O3:O701, \"C. diff\")","v":0},{"$f":"COUNTIF(April!O3:O701, \"Cellulitis/Wound Infection\")","v":0},{"$f":"COUNTIF(April!O3:O701, \"COVID-19 (Presumptive)\")","v":0},{"$f":"COUNTIF(April!O3:O701, \"GI Illness\")","v":0},{"$f":"COUNTIF(April!O3:O701, \"Influenza (confirmed)\")","v":0},{"$f":"COUNTIF(April!O3:O701, \"Influenza-like Illness\")","v":0},{"$f":"COUNTIF(April!O3:O701, \"Norovirus\")","v":0},{"$f":"COUNTIF(April!O3:O701, \"Pneumonia\")","v":0},{"$f":"COUNTIF(April!O3:O701, \"Scabies\")","v":0},{"$f":"COUNTIF(April!O3:O701, \"Strep Throat\")","v":0},{"$f":"COUNTIF(April!O3:O701, \"Other\")","v":0},null,null,"April",{"$f":"COUNTIF(April!C3:C601, \"RN/LPN\")","v":0},{"$f":"COUNTIF(April!C3:C599, \"Nursing Assistant\")","v":0},{"$f":"COUNTIF(April!C3:C599, \"Environmental Services\")","v":0},{"$f":"COUNTIF(April!C3:C599, \"Dietary\")","v":0},{"$f":"COUNTIF(April!C3:C599, \"Laundry\")","v":0},{"$f":"COUNTIF(April!C3:C599, \"Rehab- PT/OT\")","v":0},{"$f":"COUNTIF(April!C3:C599, \"Respiratory Therapy\")","v":0},{"$f":"COUNTIF(April!C3:C599, \"Activities\")","v":0},{"$f":"COUNTIF(April!C3:C599, \"Administration/Front Desk\")","v":0},{"$f":"COUNTIF(April!C3:C599, \"Maintenance\")","v":0},{"$f":"COUNTIF(April!C3:C599, \"Provider- MD/DO/NP/PA\")","v":0},{"$f":"COUNTIF(April!C3:C599, \"Other\")","v":0}]
[null,null,"May",0,{"$f":"COUNTIF(May!O3:O701, \"C. diff\")","v":0},{"$f":"COUNTIF(May!O3:O701, \"Cellulitis/Wound Infection\")","v":0},{"$f":"COUNTIF(May!O3:O701, \"COVID-19 (Presumptive)\")","v":0},{"$f":"COUNTIF(May!O3:O701, \"GI Illness\")","v":0},{"$f":"COUNTIF(May!O3:O701, \"Influenza (confirmed)\")","v":0},{"$f":"COUNTIF(May!O3:O701, \"Influenza-like Illness\")","v":0},{"$f":"COUNTIF(May!O3:O701, \"Norovirus\")","v":0},{"$f":"COUNTIF(May!O3:O701, \"Pneumonia\")","v":0},{"$f":"COUNTIF(May!O3:O701, \"Scabies\")","v":0},{"$f":"COUNTIF(May!O3:O701, \"Strep Throat\")","v":0},{"$f":"COUNTIF(May!O3:O701, \"Other\")","v":0},null,null,"May",{"$f":"COUNTIF(May!C3:C602, \"RN/LPN\")","v":0},{"$f":"COUNTIF(May!C3:C599, \"Nursing Assistant\")","v":0},{"$f":"COUNTIF(May!C3:C599, \"Environmental Services\")","v":0},{"$f":"COUNTIF(May!C3:C599, \"Dietary\")","v":0},{"$f":"COUNTIF(May!C3:C599, \"Laundry\")","v":0},{"$f":"COUNTIF(May!C3:C599, \"Rehab- PT/OT\")","v":0},{"$f":"COUNTIF(May!C3:C599, \"Respiratory Therapy\")","v":0},{"$f":"COUNTIF(May!C3:C599, \"Activities\")","v":0},{"$f":"COUNTIF(May!C3:C599, \"Administration/Front Desk\")","v":0},{"$f":"COUNTIF(May!C3:C599, \"Maintenance\")","v":0},{"$f":"COUNTIF(May!C3:C599, \"Provider- MD/DO/NP/PA\")","v":0},{"$f":"COUNTIF(May!C3:C599, \"Other\")","v":0}]
[null,null,"June",0,{"$f":"COUNTIF(June!O3:O701, \"C. diff\")","v":0},{"$f":"COUNTIF(June!O3:O701, \"Cellulitis/Wound Infection\")","v":0},{"$f":"COUNTIF(June!O3:O701, \"COVID-19 (Presumptive)\")","v":0},{"$f":"COUNTIF(June!O3:O701, \"GI Illness\")","v":0},{"$f":"COUNTIF(June!O3:O701, \"Influenza (confirmed)\")","v":0},{"$f":"COUNTIF(June!O3:O701, \"Influenza-like Illness\")","v":0},{"$f":"COUNTIF(June!O3:O701, \"Norovirus\")","v":0},{"$f":"COUNTIF(June!O3:O701, \"Pneumonia\")","v":0},{"$f":"COUNTIF(June!O3:O701, \"Scabies\")","v":0},{"$f":"COUNTIF(June!O3:O701, \"Strep Throat\")","v":0},{"$f":"COUNTIF(June!O3:O701, \"Other\")","v":0},null,null,"June",{"$f":"COUNTIF(June!C3:C599, \"RN/LPN\")","v":0},{"$f":"COUNTIF(June!C3:C599, \"Nursing Assistant\")","v":0},{"$f":"COUNTIF(June!C3:C599, \"Environmental Services\")","v":0},{"$f":"COUNTIF(June!C3:C599, \"Dietary\")","v":0},{"$f":"COUNTIF(June!C3:C599, \"Laundry\")","v":0},{"$f":"COUNTIF(June!C3:C599, \"Rehab- PT/OT\")","v":0},{"$f":"COUNTIF(June!C3:C599, \"Respiratory Therapy\")","v":0},{"$f":"COUNTIF(June!C3:C599, \"Activities\")","v":0},{"$f":"COUNTIF(June!C3:C599, \"Administration/Front Desk\")","v":0},{"$f":"COUNTIF(June!C3:C599, \"Maintenance\")","v":0},{"$f":"COUNTIF(June!C3:C599, \"Provider- MD/DO/NP/PA\")","v":0},{"$f":"COUNTIF(June!C3:C599, \"Other\")","v":0}]
[null,null,"July",0,{"$f":"COUNTIF(July!O3:O701, \"C. diff\")","v":0},{"$f":"COUNTIF(July!O3:O701, \"Cellulitis/Wound Infection\")","v":0},{"$f":"COUNTIF(July!O3:O701, \"COVID-19 (Presumptive)\")","v":0},{"$f":"COUNTIF(July!O3:O701, \"GI Illness\")","v":0},{"$f":"COUNTIF(July!O3:O701, \"Influenza (confirmed)\")","v":0},{"$f":"COUNTIF(July!O3:O701, \"Influenza-like Illness\")","v":0},{"$f":"COUNTIF(July!O3:O701, \"Norovirus\")","v":0},{"$f":"COUNTIF(July!O3:O701, \"Pneumonia\")","v":0},{"$f":"COUNTIF(July!O3:O701, \"Scabies\")","v":0},{"$f":"COUNTIF(July!O3:O701, \"Strep Throat\")","v":0},{"$f":"COUNTIF(July!O3:O701, \"Other\")","v":0},null,null,"July",{"$f":"COUNTIF(July!C3:C599, \"RN/LPN\")","v":0},{"$f":"COUNTIF(July!C3:C599, \"Nursing Assistant\")","v":0},{"$f":"COUNTIF(July!C3:C599, \"Environmental Services\")","v":0},{"$f":"COUNTIF(July!C3:C599, \"Dietary\")","v":0},{"$f":"COUNTIF(July!C3:C599, \"Laundry\")","v":0},{"$f":"COUNTIF(July!C3:C599, \"Rehab- PT/OT\")","v":0},{"$f":"COUNTIF(July!C3:C599, \"Respiratory Therapy\")","v":0},{"$f":"COUNTIF(July!C3:C599, \"Activities\")","v":0},{"$f":"COUNTIF(July!C3:C599, \"Administration/Front Desk\")","v":0},{"$f":"COUNTIF(July!C3:C599, \"Maintenance\")","v":0},{"$f":"COUNTIF(July!C3:C599, \"Provider- MD/DO/NP/PA\")","v":0},{"$f":"COUNTIF(July!C3:C599, \"Other\")","v":0}]
[null,null,"August",0,{"$f":"COUNTIF(August!O3:O701, \"C. diff\")","v":0},{"$f":"COUNTIF(August!O3:O701, \"Cellulitis/Wound Infection\")","v":0},{"$f":"COUNTIF(August!O3:O701, \"COVID-19 (Presumptive)\")","v":0},{"$f":"COUNTIF(August!O3:O701, \"GI Illness\")","v":0},{"$f":"COUNTIF(August!O3:O701, \"Influenza (confirmed)\")","v":0},{"$f":"COUNTIF(August!O3:O701, \"Influenza-like Illness\")","v":0},{"$f":"COUNTIF(August!O3:O701, \"Norovirus\")","v":0},{"$f":"COUNTIF(August!O3:O701, \"Pneumonia\")","v":0},{"$f":"COUNTIF(August!O3:O701, \"Scabies\")","v":0},{"$f":"COUNTIF(August!O3:O701, \"Strep Throat\")","v":0},{"$f":"COUNTIF(August!O3:O701, \"Other\")","v":0},null,null,"August",{"$f":"COUNTIF(August!C3:C599, \"RN/LPN\")","v":0},{"$f":"COUNTIF(August!C3:C599, \"Nursing Assistant\")","v":0},{"$f":"COUNTIF(August!C3:C599, \"Environmental Services\")","v":0},{"$f":"COUNTIF(August!C3:C599, \"Dietary\")","v":0},{"$f":"COUNTIF(August!C3:C599, \"Laundry\")","v":0},{"$f":"COUNTIF(August!C3:C599, \"Rehab- PT/OT\")","v":0},{"$f":"COUNTIF(August!C3:C599, \"Respiratory Therapy\")","v":0},{"$f":"COUNTIF(August!C3:C599, \"Activities\")","v":0},{"$f":"COUNTIF(August!C3:C599, \"Administration/Front Desk\")","v":0},{"$f":"COUNTIF(August!C3:C599, \"Maintenance\")","v":0},{"$f":"COUNTIF(August!C3:C599, \"Provider- MD/DO/NP/PA\")","v":0},{"$f":"COUNTIF(August!C3:C599, \"Other\")","v":0}]
[null,null,"September",0,{"$f":"COUNTIF(September!O3:O701, \"C. diff\")","v":0},{"$f":"COUNTIF(September!O3:O701, \"Cellulitis/Wound Infection\")","v":0},{"$f":"COUNTIF(September!O3:O701, \"COVID-19 (Presumptive)\")","v":0},{"$f":"COUNTIF(September!O3:O701, \"GI Illness\")","v":0},{"$f":"COUNTIF(September!O3:O701, \"Influenza (confirmed)\")","v":0},{"$f":"COUNTIF(September!O3:O701, \"Influenza-like Illness\")","v":0},{"$f":"COUNTIF(September!O3:O701, \"Norovirus\")","v":0},{"$f":"COUNTIF(September!O3:O701, \"Pneumonia\")","v":0},{"$f":"COUNTIF(September!O3:O701, \"Scabies\")","v":0},{"$f":"COUNTIF(September!O3:O701, \"Strep Throat\")","v":0},{"$f":"COUNTIF(September!O3:O701, \"Other\")","v":0},null,null,"September",{"$f":"COUNTIF(September!C3:C599, \"RN/LPN\")","v":0},{"$f":"COUNTIF(September!C3:C599, \"Nursing Assistant\")","v":0},{"$f":"COUNTIF(September!C3:C599, \"Environmental Services\")","v":0},{"$f":"COUNTIF(September!C3:C599, \"Dietary\")","v":0},{"$f":"COUNTIF(September!C3:C599, \"Laundry\")","v":0},{"$f":"COUNTIF(September!C3:C599, \"Rehab- PT/OT\")","v":0},{"$f":"COUNTIF(September!C3:C599, \"Respiratory Therapy\")","v":0},{"$f":"COUNTIF(September!C3:C599, \"Activities\")","v":0},{"$f":"COUNTIF(September!C3:C599, \"Administration/Front Desk\")","v":0},{"$f":"COUNTIF(September!C3:C599, \"Maintenance\")","v":0},{"$f":"COUNTIF(September!C3:C599, \"Provider- MD/DO/NP/PA\")","v":0},{"$f":"COUNTIF(September!C3:C599, \"Other\")","v":0}]
{"$rows_left_out":5}
{"sheet":"January","index":2,"n_rows":2,"n_cols":21,"rows_kept":2,"cut":false,"hidden":false,"merged":[[0,17,0,20],[0,0,0,9],[0,10,0,15]]}
["Employee Information",null,null,null,null,null,null,null,null,null,"Diagnostics ",null,null,null,null,null,null,"Treatment Information"]
["Department/Unit","Employee Name","Job Title(s)","Symptoms","Symptom Onset Date","Date Illness Reported","Date of Last Shift","Date Symptoms Resolved","Date Return to Work","Employee Notes","Diagnostic Performed? Y/N","Test Date","Type of Test","Specimen Source","Results","Temperature (if applicable)","Diagnostic Notes","Treatment? Y/N","Treatment Type","Treatment Start Date","Treatment Notes"]

{"sheet":"February","index":3,"n_rows":2,"n_cols":21,"rows_kept":2,"cut":false,"hidden":false,"merged":[[0,0,0,9],[0,10,0,15],[0,17,0,20]]}
["Employee Information",null,null,null,null,null,null,null,null,null,"Diagnostics ",null,null,null,null,null,null,"Treatment Information"]
["Department/Unit","Employee Name","Job Title(s)","Symptoms","Symptom Onset Date","Date Illness Reported","Date of Last Shift","Date Symptoms Resolved","Date Return to Work","Employee Notes","Diagnostic Performed? Y/N","Test Date","Type of Test","Specimen Source","Results","Temperature (if applicable)","Diagnostic Notes","Treatment? Y/N","Treatment Type","Treatment Start Date","Treatment Notes"]

{"sheet":"March","index":4,"n_rows":2,"n_cols":21,"rows_kept":2,"cut":false,"hidden":false,"merged":[[0,0,0,9],[0,10,0,15],[0,17,0,20]]}
["Employee Information",null,null,null,null,null,null,null,null,null,"Diagnostics ",null,null,null,null,null,null,"Treatment Information"]
["Department/Unit","Employee Name","Job Title(s)","Symptoms","Symptom Onset Date","Date Illness Reported","Date of Last Shift","Date Symptoms Resolved","Date Return to Work","Employee Notes","Diagnostic Performed? Y/N","Test Date","Type of Test","Specimen Source","Results","Temperature (if applicable)","Diagnostic Notes","Treatment? Y/N","Treatment Type","Treatment Start Date","Treatment Notes"]

{"sheet":"April","index":5,"n_rows":2,"n_cols":21,"rows_kept":2,"cut":false,"hidden":false,"merged":[[0,0,0,9],[0,10,0,15],[0,17,0,20]]}
["Employee Information",null,null,null,null,null,null,null,null,null,"Diagnostics ",null,null,null,null,null,null,"Treatment Information"]
["Department/Unit","Employee Name","Job Title(s)","Symptoms","Symptom Onset Date","Date Illness Reported","Date of Last Shift","Date Symptoms Resolved","Date Return to Work","Employee Notes","Diagnostic Performed? Y/N","Test Date","Type of Test","Specimen Source","Results","Temperature (if applicable)","Diagnostic Notes","Treatment? Y/N","Treatment Type","Treatment Start Date","Treatment Notes"]

{"sheet":"May","index":6,"n_rows":2,"n_cols":21,"rows_kept":2,"cut":false,"hidden":false,"merged":[[0,0,0,9],[0,10,0,15],[0,17,0,20]]}
["Employee Information",null,null,null,null,null,null,null,null,null,"Diagnostics ",null,null,null,null,null,null,"Treatment Information"]
["Department/Unit","Employee Name","Job Title(s)","Symptoms","Symptom Onset Date","Date Illness Reported","Date of Last Shift","Date Symptoms Resolved","Date Return to Work","Employee Notes","Diagnostic Performed? Y/N","Test Date","Type of Test","Specimen Source","Results","Temperature (if applicable)","Diagnostic Notes","Treatment? Y/N","Treatment Type","Treatment Start Date","Treatment Notes"]

{"sheet":"June","index":7,"n_rows":2,"n_cols":21,"rows_kept":2,"cut":false,"hidden":false,"merged":[[0,0,0,9],[0,10,0,15],[0,17,0,20]]}
["Employee Information",null,null,null,null,null,null,null,null,null,"Diagnostics ",null,null,null,null,null,null,"Treatment Information"]
["Department/Unit","Employee Name","Job Title(s)","Symptoms","Symptom Onset Date","Date Illness Reported","Date of Last Shift","Date Symptoms Resolved","Date Return to Work","Employee Notes","Diagnostic Performed? Y/N","Test Date","Type of Test","Specimen Source","Results","Temperature (if applicable)","Diagnostic Notes","Treatment? Y/N","Treatment Type","Treatment Start Date","Treatment Notes"]

{"sheet":"July","index":8,"n_rows":2,"n_cols":21,"rows_kept":2,"cut":false,"hidden":false,"merged":[[0,0,0,9],[0,10,0,15],[0,17,0,20]]}
["Employee Information",null,null,null,null,null,null,null,null,null,"Diagnostics ",null,null,null,null,null,null,"Treatment Information"]
["Department/Unit","Employee Name","Job Title(s)","Symptoms","Symptom Onset Date","Date Illness Reported","Date of Last Shift","Date Symptoms Resolved","Date Return to Work","Employee Notes","Diagnostic Performed? Y/N","Test Date","Type of Test","Specimen Source","Results","Temperature (if applicable)","Diagnostic Notes","Treatment? Y/N","Treatment Type","Treatment Start Date","Treatment Notes"]

{"sheet":"August","index":9,"n_rows":2,"n_cols":21,"rows_kept":2,"cut":false,"hidden":false,"merged":[[0,0,0,9],[0,10,0,15],[0,17,0,20]]}
["Employee Information",null,null,null,null,null,null,null,null,null,"Diagnostics ",null,null,null,null,null,null,"Treatment Information"]
["Department/Unit","Employee Name","Job Title(s)","Symptoms","Symptom Onset Date","Date Illness Reported","Date of Last Shift","Date Symptoms Resolved","Date Return to Work","Employee Notes","Diagnostic Performed? Y/N","Test Date","Type of Test","Specimen Source","Results","Temperature (if applicable)","Diagnostic Notes","Treatment? Y/N","Treatment Type","Treatment Start Date","Treatment Notes"]

{"sheet":"September","index":10,"n_rows":2,"n_cols":21,"rows_kept":2,"cut":false,"hidden":false,"merged":[[0,0,0,9],[0,10,0,15],[0,17,0,20]]}
["Employee Information",null,null,null,null,null,null,null,null,null,"Diagnostics ",null,null,null,null,null,null,"Treatment Information"]
["Department/Unit","Employee Name","Job Title(s)","Symptoms","Symptom Onset Date","Date Illness Reported","Date of Last Shift","Date Symptoms Resolved","Date Return to Work","Employee Notes","Diagnostic Performed? Y/N","Test Date","Type of Test","Specimen Source","Results","Temperature (if applicable)","Diagnostic Notes","Treatment? Y/N","Treatment Type","Treatment Start Date","Treatment Notes"]

{"sheet":"October","index":11,"n_rows":2,"n_cols":21,"rows_kept":2,"cut":false,"hidden":false,"merged":[[0,0,0,9],[0,10,0,15],[0,17,0,20]]}
["Employee Information",null,null,null,null,null,null,null,null,null,"Diagnostics ",null,null,null,null,null,null,"Treatment Information"]
["Department/Unit","Employee Name","Job Title(s)","Symptoms","Symptom Onset Date","Date Illness Reported","Date of Last Shift","Date Symptoms Resolved","Date Return to Work","Employee Notes","Diagnostic Performed? Y/N","Test Date","Type of Test","Specimen Source","Results","Temperature (if applicable)","Diagnostic Notes","Treatment? Y/N","Treatment Type","Treatment Start Date","Treatment Notes"]

{"sheet":"November","index":12,"n_rows":2,"n_cols":21,"rows_kept":2,"cut":false,"hidden":false,"merged":[[0,0,0,9],[0,10,0,15],[0,17,0,20]]}
["Employee Information",null,null,null,null,null,null,null,null,null,"Diagnostics ",null,null,null,null,null,null,"Treatment Information"]
["Department/Unit","Employee Name","Job Title(s)","Symptoms","Symptom Onset Date","Date Illness Reported","Date of Last Shift","Date Symptoms Resolved","Date Return to Work","Employee Notes","Diagnostic Performed? Y/N","Test Date","Type of Test","Specimen Source","Results","Temperature (if applicable)","Diagnostic Notes","Treatment? Y/N","Treatment Type","Treatment Start Date","Treatment Notes"]

{"sheet":"December","index":13,"n_rows":2,"n_cols":21,"rows_kept":2,"cut":false,"hidden":false,"merged":[[0,0,0,9],[0,10,0,15],[0,17,0,20]]}
["Employee Information",null,null,null,null,null,null,null,null,null,"Diagnostics ",null,null,null,null,null,null,"Treatment Information"]
["Department/Unit","Employee Name","Job Title(s)","Symptoms","Symptom Onset Date","Date Illness Reported","Date of Last Shift","Date Symptoms Resolved","Date Return to Work","Employee Notes","Diagnostic Performed? Y/N","Test Date","Type of Test","Specimen Source","Results","Temperature (if applicable)","Diagnostic Notes","Treatment? Y/N","Treatment Type","Treatment Start Date","Treatment Notes"]

{"sheet":"Lookups","index":14,"n_rows":22,"n_cols":19,"rows_kept":22,"cut":false,"hidden":false,"merged":[]}
[null,null,"Symptoms",null,"ABX Information",null,"Results",null,"Department/Unit",null,null,null,"Specimen Source",null,null,"Staff Title",null,null,"Treatment Type"]
[null,null,"Abdominal Pain",null,"Yes",null,"C. diff",null,null,null,null,null,"Urine",null,null,"RN/LPN",null,null,"Antibiotic "]
[null,null,"Chills",null,"No",null,"Cellulitis/Wound Infection",null,null,null,null,null,"Sputum",null,null,"Nursing Assistant",null,null,"Anti-fungal"]
[null,null,"Cough (new or increased)",null,null,null,"COVID-19 (Presumptive)",null,null,null,null,null,"Blood",null,null,"Environmental Services",null,null,"Anti-viral"]
[null,null,"Diarrhea",null,null,null,"GI Illness",null,null,null,null,null,"Stool",null,null,"Dietary",null,null,"Scabicide"]
[null,null,"Eye",null,null,null,"Influenza-like Illness",null,null,null,null,null,"Throat",null,null,"Laundry",null,null,"Other"]
[null,null,"Fever",null,null,null,"Influenza (confirmed)",null,null,null,null,null,"Rectal",null,null,"Rehab- PT/OT"]
[null,null,"Headache ",null,null,null,"Norovirus",null,null,null,null,null,"Wound",null,null,"Respiratory Therapy"]
[null,null,"Increased Sputum Production",null,null,null,"Pneumonia",null,null,null,null,null,"Skin",null,null,"Activities"]
[null,null,"Lice",null,null,null,"Scabies",null,null,null,null,null,"Nasal",null,null,"Administration/Front Desk"]
{"$rows_left_out":12}